Échecs (jeu)
related: cb13182853p
related: cb12064757j
related: https://data.bnf.fr/ark:/12148/cb12155867b
modified: 2018-09-11
narrower: https://data.bnf.fr/ark:/12148/cb167150389
P61160: http://www.rdaregistry.info/termList/statIdentification/1001
narrower: cb12365457g
related: cb12652138z
narrower: https://data.bnf.fr/ark:/12148/cb119319215
narrower: cb14487537g
note: Jeu de stratégie par affrontement
narrower: cb11955212n
FRBNF: 11931920
narrower: https://data.bnf.fr/ark:/12148/cb119679170
type: Concept
narrower: cb17028792w
broader: https://data.bnf.fr/ark:/12148/cb131644242
domaine litteral: Sports et jeux
narrower: cb11967916n
is part of: r166
created: 1985-07-06
editorial note: Grand Larousse universel. - . - Quid 2006. - . -
related match: Chess
narrower: cb11944132j

Le jeu d'échecs : Le site complet
type: ExpositionVirtuelle
type: Document
subject: Échecs (jeu)
description: L’exploration interactive des pièces d'un jeu, longtemps attribué à Charlemagne et qui compte parmi les plus beaux objets en ivoire du Moyen Âge, introduit un dossier complet sur l’histoire, l’évolution et la symbolique du jeu d’échecs à travers les différentes cultures qui l’ont adopté. Un prolongement sur le rôle des échecs en littérature permet de croiser des auteurs modernes : Carroll, Zweig, Nabokov, Pérec… Un parcours en images à travers des manuscrits invite à redécouvrir le chevalier échiquéen de la Table ronde, les pièces personnifiées des Echecs moralisés et des Echecs amoureux. Des repères et des pistes pédagogiques permettent aux enseignants d’aborder le jeu en classe.