Intellectuels
narrower: cb11931758z
alternative label: Penseurs
alternative label: Et les intellectuels
narrower: https://data.bnf.fr/ark:/12148/cb126502978
alternative label: Intelligentsia
domaine litteral: Sciences sociales. Sociologie
related: https://data.bnf.fr/ark:/12148/cb16245024c
narrower: cb15103298v
alternative label: Milieux intellectuels
related: cb11933704h
created: 1985-07-06
alternative label: Travailleurs intellectuels
related: https://data.bnf.fr/ark:/12148/cb11933785b
FRBNF: 11932127
narrower: https://data.bnf.fr/ark:/12148/cb126476130
P61160: http://www.rdaregistry.info/termList/statIdentification/1001
narrower: cb11986865r
narrower: cb12003062q
is part of: r166
alternative label: Et les intellectuelles
modified: 2023-08-10
narrower: https://data.bnf.fr/ark:/12148/cb119578285
alternative label: Milieu intellectuel
broader: cb11934124q
type: Concept
scope note: Voir aussi la subdivision Vie intellectuelle aux catégories de personnes, groupes ethniques et lieux

Intellectuals