Lisbonne (Portugal)
long: -9.13333333333333
cadre geographique: cxbc
type: SpatialThing
lat long: W 9°8' / N 38°44'
lat: 38.7333333333333

Lisbonne (Portugal)
modified: 2017-02-13
related: cb16716138t
FRBNF: 11932254
related: https://data.bnf.fr/ark:/12148/cb171317917
domaine litteral: Géographie de l'Europe
type: Concept
is part of: r167
P61160: http://www.rdaregistry.info/termList/statIdentification/1001
created: 1985-07-06
scope note: Voir aussi la subdivision Et Lisbonne [sans subd. géogr.] aux collectivités (à l'exception des types de collectivités) et aux personnes
note: Capitale du Portugal

Lisbonne (Portugal)
alternative label: Lisabona @it
alternative label: Lisboa (Portugal) @pt
type: Concept
alternative label: Felicitas Julia @la
alternative label: Olisipo @la
alternative label: Lisbonne
alternative label: Ulissipona
alternative label: Lisbon @en
alternative label: Al-Uchbūna @ar
alternative label: Felicitas Julia (ville ancienne) @la
modified: 2001-10-30
P61160: http://www.rdaregistry.info/termList/statIdentification/1001
FRBNF: 15238758
alternative label: Olisippo @la
alternative label: Al-Uchbūna (Portugal) @ar
created: 1989-03-29
broader: cb15238541q
alternative label: Olisipo (ville ancienne) @la
alternative label: Lissabon @de
focus: Lisbonne (Portugal)

Lisbon (Portugal)