Musique -- Étude et enseignement pour la jeunesse
type: Concept
created: 1985-07-06
domaine: cb13318807v
alternative label: Musique -- Enseignement pour la jeunesse
broader: https://data.bnf.fr/ark:/12148/cb119325579
FRBNF: 11932561
related: https://data.bnf.fr/ark:/12148/cb125066023
domaine: https://data.bnf.fr/ark:/12148/cb133183660
alternative label: Éveil musical
related: https://data.bnf.fr/ark:/12148/cb122949619
is part of: r166
scope note: Sous cette vedette, on trouve les documents sur l'enseignement de la musique aux enfants et adolescents. Ne pas employer pour les manuels et méthodes de musique
scope note: Voir aussi la subdivision Étude et enseignement pour la jeunesse aux compositions musicales et instruments de musique
scope note: Voir aussi la subdivision de forme Études et exercices (musique) pour la jeunesse aux instruments de musique et aux sujets noms communs appropriés (matières de l'enseignement musical)
scope note: Voir aussi la subdivision de forme Méthodes (musique) pour la jeunesse aux instruments de musique
modified: 2023-06-07
P61160: http://www.rdaregistry.info/termList/statIdentification/1001
related: cb12487018j
related: https://data.bnf.fr/ark:/12148/cb119758628
alternative label: Éducation musicale
related: https://data.bnf.fr/ark:/12148/cb119695328

Music--Instruction and study--Juvenile