Navigation
related: cb12004140x
modified: 2023-06-07
type: Concept
domaine: cb11933639w
alternative label: Navigazione marittima @it
related: https://data.bnf.fr/ark:/12148/cb119708355
related: https://data.bnf.fr/ark:/12148/cb119588408
narrower: cb11979890g
related: cb13591975x
narrower: https://data.bnf.fr/ark:/12148/cb119824572
narrower: cb11973090t
narrower: https://data.bnf.fr/ark:/12148/cb123350850
narrower: cb11980067s
alternative label: Navigation de commerce
related: cb18024307w
narrower: https://data.bnf.fr/ark:/12148/cb119695448
broader: cb13318725h
narrower: cb11932603n
created: 1985-07-06
alternative label: Navigation maritime
related: https://data.bnf.fr/ark:/12148/cb131632050
alternative label: Navigation hauturière
FRBNF: 11932602
narrower: https://data.bnf.fr/ark:/12148/cb133189043
P61160: http://www.rdaregistry.info/termList/statIdentification/1001
narrower: cb12335084n
narrower: cb11935887s
narrower: https://data.bnf.fr/ark:/12148/cb119778366
narrower: https://data.bnf.fr/ark:/12148/cb124919581
narrower: cb12040870n
narrower: cb18024616p
narrower: https://data.bnf.fr/ark:/12148/cb133186911
narrower: cb11978071r
related: https://data.bnf.fr/ark:/12148/cb119470293
is part of: r166
scope note: Voir aussi les vedettes commençant par Navigation
related: cb11935277t
narrower: cb11978074s
related: cb11935857v
narrower: https://data.bnf.fr/ark:/12148/cb119780696
domaine litteral: Économie politique. Travail

Navigation

Navigazione marittima