Psychologie de l'éducation
broader: cb12648119x
alternative label: Psychologie pédagogique
broader: cb11975049v
narrower: cb15501338g
related: https://data.bnf.fr/ark:/12148/cb11930829d
related: cb11933049j
alternative label: Éducation, Psychologie de
narrower: https://data.bnf.fr/ark:/12148/cb119497552
narrower: cb13162719t
domaine: https://data.bnf.fr/ark:/12148/cb119408497
narrower: https://data.bnf.fr/ark:/12148/cb180959495
narrower: cb17958782r
alternative label: Pédagogie expérimentale
narrower: cb11978107x
narrower: cb11932744h
narrower: https://data.bnf.fr/ark:/12148/cb11937229f
FRBNF: 11932674
modified: 2023-06-08
narrower: cb11970729z
domaine: cb13318807v
narrower: https://data.bnf.fr/ark:/12148/cb120668339
scope note: Sous cette vedette, on trouve les documents étudiant d'un point de vue psychologique l'action éducative ainsi que les institutions, méthodes, programmes scolaires, etc. Les documents sur l'application des méthodes psychologiques dans le cadre scolaire se trouvent sous Psychologie scolaire
type: Concept
narrower: cb16665779p
narrower: https://data.bnf.fr/ark:/12148/cb119600739
related: https://data.bnf.fr/ark:/12148/cb133183095
alternative label: Psicopedagogia @it
P61160: http://www.rdaregistry.info/termList/statIdentification/1001
is part of: r166
alternative label: Éducation -- Aspect psychologique
narrower: https://data.bnf.fr/ark:/12148/cb11945945b
narrower: cb11982720j
related: https://data.bnf.fr/ark:/12148/cb12312537c
related: cb11936580s
created: 1985-07-06
narrower: https://data.bnf.fr/ark:/12148/cb119778575
narrower: cb18081747r
alternative label: Psychopédagogie

Educational psychology

Psicopedagogia