Ponts
narrower: cb12542207k
narrower: cb17933416h
narrower: https://data.bnf.fr/ark:/12148/cb13510372b
narrower: cb13510337t
alternative label: Ponts-autoroutes
modified: 2023-06-08
narrower: https://data.bnf.fr/ark:/12148/cb11982972b
alternative label: Cours d'eau -- Ponts
related: https://data.bnf.fr/ark:/12148/cb177973310
narrower: cb13611862t
narrower: cb13177898n
narrower: cb11977054x
narrower: cb11982700x
broader: cb13319263x
alternative label: Ponts routiers
P61160: http://www.rdaregistry.info/termList/statIdentification/1001
related: https://data.bnf.fr/ark:/12148/cb11979258b
related: cb13771173z
broader: cb12331207s
narrower: https://data.bnf.fr/ark:/12148/cb119428084
alternative label: Ponts autoroutiers
narrower: cb11981138q
domaine: cb11933639w
scope note: Voir aussi aux noms des ponts, par ex. : Paris (France) -- Pont Mirabeau
related: https://data.bnf.fr/ark:/12148/cb119687437
narrower: cb11977053k
narrower: cb12444544x
narrower: cb15086580t
FRBNF: 11932837
alternative label: Routes -- Ponts
narrower: cb11932838v
alternative label: Autoroutes -- Ponts
narrower: https://data.bnf.fr/ark:/12148/cb123336030
type: Concept
narrower: https://data.bnf.fr/ark:/12148/cb125432530
created: 1985-07-06
narrower: https://data.bnf.fr/ark:/12148/cb11978142f
narrower: cb13746694w
domaine: https://data.bnf.fr/ark:/12148/cb119361544
alternative label: Ponts obliques
is part of: r166
related: cb12488342g
editorial note: Grand Larousse universel. - . - Grand Robert de la langue française, 2001. - . - Encycl. universalis. - http://www.universalis-edu.com. - 2019-03-04
narrower: cb11972153n
alternative label: Ponts biais
narrower: https://data.bnf.fr/ark:/12148/cb157354856
narrower: cb12049325m
narrower: https://data.bnf.fr/ark:/12148/cb119827018
alternative label: Ponts-routes
related: https://data.bnf.fr/ark:/12148/cb119445408
narrower: cb12285856g
related: https://data.bnf.fr/ark:/12148/cb119709254
narrower: https://data.bnf.fr/ark:/12148/cb169995855
related: cb12067272s

Bridges