Réseaux d'ordinateurs
narrower: cb11985415v
is part of: r166
narrower: https://data.bnf.fr/ark:/12148/cb131825488
alternative label: Reti di elaboratori @it
narrower: https://data.bnf.fr/ark:/12148/cb14568471c
narrower: https://data.bnf.fr/ark:/12148/cb119828335
related: cb12433109v
narrower: https://data.bnf.fr/ark:/12148/cb155234061
narrower: cb11973092h
narrower: https://data.bnf.fr/ark:/12148/cb145789055
related: cb11932111w
alternative label: Télétraitement, Réseaux de
broader: https://data.bnf.fr/ark:/12148/cb119335984
narrower: https://data.bnf.fr/ark:/12148/cb123135546
alternative label: Réseaux hétérogènes (informatique)
FRBNF: 11932899
alternative label: Réseaux informatiques
narrower: https://data.bnf.fr/ark:/12148/cb120029561
narrower: cb12488429j
narrower: cb16934387v
related: cb15563676k
related: https://data.bnf.fr/ark:/12148/cb119401913
scope note: S'emploie également en subdivision à tous sujets noms communs et noms propres
alternative label: Systèmes de communication d'ordinateurs
alternative label: Ordinateurs, Réseaux d'
narrower: cb12540281h
narrower: https://data.bnf.fr/ark:/12148/cb119623608
domaine: https://data.bnf.fr/ark:/12148/cb11932109b
narrower: https://data.bnf.fr/ark:/12148/cb123413763
narrower: cb16656930x
type: Concept
narrower: https://data.bnf.fr/ark:/12148/cb135462368
related match: Computer networks
alternative label: Réseaux à haut débit (informatique)
narrower: https://data.bnf.fr/ark:/12148/cb119666722
narrower: https://data.bnf.fr/ark:/12148/cb119772445
modified: 2023-06-08
P61160: http://www.rdaregistry.info/termList/statIdentification/1001
narrower: https://data.bnf.fr/ark:/12148/cb125605614
narrower: https://data.bnf.fr/ark:/12148/cb11971490f
broader: https://data.bnf.fr/ark:/12148/cb11932109b
broader: https://data.bnf.fr/ark:/12148/cb119327017
related: https://data.bnf.fr/ark:/12148/cb125744344
narrower: cb12537634k
narrower: cb13168215h
alternative label: Ordinateurs -- Réseaux à haut débit
narrower: https://data.bnf.fr/ark:/12148/cb123370399
broader: https://data.bnf.fr/ark:/12148/cb11931895f
narrower: https://data.bnf.fr/ark:/12148/cb13616403d
narrower: https://data.bnf.fr/ark:/12148/cb12520543c
narrower: https://data.bnf.fr/ark:/12148/cb144640687
broader: cb11950616x
alternative label: Réseaux de télétraitement
created: 1985-07-06

Reti di elaboratori