Palestine
description: Région du Proche-Orient entre le Liban au Nord, la mer Morte au Sud, la Méditerranée à l'Ouest et le désert syrien à l'Est, elle est conquise par les arabes entre 634 et 640
cadre geographique: cway
type: SpatialThing

Palestine
modified: 2017-02-13
type: Concept
related: cb13507488g
related: https://data.bnf.fr/ark:/12148/cb12566954d
related: https://data.bnf.fr/ark:/12148/cb119512898
related: https://data.bnf.fr/ark:/12148/cb180444365
related: cb11968945g
related: https://data.bnf.fr/ark:/12148/cb120000651
related: cb12272406w
related: cb12529829t
related: cb12077094r
related: https://data.bnf.fr/ark:/12148/cb119402305
P61160: http://www.rdaregistry.info/termList/statIdentification/1001
domaine litteral: Histoire du reste du monde
related: https://data.bnf.fr/ark:/12148/cb155133176
related: https://data.bnf.fr/ark:/12148/cb169338708
domaine litteral: Géographie du reste du monde
related: https://data.bnf.fr/ark:/12148/cb119768390
scope note: Voir aussi la subdivision Et la Palestine [sans subd. géogr.] aux collectivités (à l'exception des types de collectivités) et aux personnes
related: https://data.bnf.fr/ark:/12148/cb119371233
is part of: r167
related: cb11981411h
related: cb11974076h
created: 1985-07-06
scope note: Voir aussi la subdivision Opinion publique palestinienne [sans subd. géogr.] aux guerres et aux lieux
scope note: Sous cette vedette, on trouve les documents sur la Palestine historique, antérieure à 1948. Les documents sur l'État palestinien incarné par l'Autorité nationale palestinienne depuis les accords de Washington (1993), comprenant les territoires de la Cisjordanie et de la Bande de Gaza, se trouvent sous Palestine (État)
related: https://data.bnf.fr/ark:/12148/cb11934249b
FRBNF: 11932928
broader: https://data.bnf.fr/ark:/12148/cb11941608b

Palestine
alternative label: Terre sainte
type: Concept
created: 1996-09-13
modified: 2002-07-15
alternative label: Chanaan
broader: https://data.bnf.fr/ark:/12148/cb152899684
P61160: http://www.rdaregistry.info/termList/statIdentification/1001
broader: cb15345671k
note: Région du Proche-Orient entre le Liban au Nord, la mer Morte au Sud, la Méditerranée à l'Ouest et le désert syrien à l'Est, elle est conquise par les arabes entre 634 et 640
alternative label: Canaan
related: cb15376425q
alternative label: Palestine ancienne
FRBNF: 15322253
focus: Palestine

Palestine