Perception

Perception
alternative label: Perception (psychologie)
broader: cb11931219p
narrower: cb11982973p
FRBNF: 11933068
narrower: cb11972091x
type: Concept
modified: 2023-06-08
related: cb11995892m
narrower: cb12651298v
narrower: https://data.bnf.fr/ark:/12148/cb12098328f
P61160: http://www.rdaregistry.info/termList/statIdentification/1001
narrower: cb11978185q
narrower: https://data.bnf.fr/ark:/12148/cb119382646
related: https://data.bnf.fr/ark:/12148/cb119330695
narrower: https://data.bnf.fr/ark:/12148/cb124454577
narrower: https://data.bnf.fr/ark:/12148/cb179816367
narrower: cb12315800k
alternative label: Psychologie de la perception
scope note: S'emploie également en subdivision
narrower: https://data.bnf.fr/ark:/12148/cb119326687
narrower: cb12409563k
narrower: cb11963379x
narrower: cb12302881g
narrower: cb11937931x
created: 1985-07-06
related: https://data.bnf.fr/ark:/12148/cb11978184c
related: cb11977898r
related: cb11960522s
narrower: https://data.bnf.fr/ark:/12148/cb11978935c
is part of: r166
related: https://data.bnf.fr/ark:/12148/cb119414481
narrower: https://data.bnf.fr/ark:/12148/cb119812291
domaine: https://data.bnf.fr/ark:/12148/cb119408497
narrower: cb11949465j
narrower: cb12422666m
alternative label: Contribution au concept de perception
related: cb12409419t
narrower: https://data.bnf.fr/ark:/12148/cb119517618
narrower: cb16159797h
narrower: cb12648885n
narrower: cb17803957p
related: https://data.bnf.fr/ark:/12148/cb11962402c
scope note: Voir aussi aux expressions composées à partir du mot Perception, par ex. : Perception du risque, Perception visuelle