Simulation, Méthodes de
FRBNF: 11933269
alternative label: Simulation, Techniques de
type: Concept
alternative label: Techniques de simulation
narrower: https://data.bnf.fr/ark:/12148/cb170172744
narrower: https://data.bnf.fr/ark:/12148/cb125107322
alternative label: Modèles de simulation
narrower: cb18108629r
narrower: https://data.bnf.fr/ark:/12148/cb133259900
narrower: cb11932895p
alternative label: Méthodes de simulation
narrower: cb11932155h
domaine: https://data.bnf.fr/ark:/12148/cb11932434c
alternative label: Simulazione <Matematica> @it
narrower: cb11956771s
alternative label: Simulation, Modèles de
created: 1985-07-06
narrower: cb11961524q
P61160: http://www.rdaregistry.info/termList/statIdentification/1001
domaine litteral: Savoir et érudition. Musées
related match: Simulation methods
related: https://data.bnf.fr/ark:/12148/cb11941518c
modified: 2023-06-08
scope note: Pour l'application générale de cette subdivision, voir le chapitre Méthodes de simulation du guide d'indexation (Règles)
narrower: cb12510731q
domaine: https://data.bnf.fr/ark:/12148/cb11932109b
scope note: S'emploie également en subdivision aux sujets noms communs appropriés (domaines, disciplines) pour la mise au point ou l'emploi de plusieurs types de modèles pour leur étude
broader: cb11941329g
related: https://data.bnf.fr/ark:/12148/cb119665169
narrower: https://data.bnf.fr/ark:/12148/cb170065704
related: https://data.bnf.fr/ark:/12148/cb135122538
narrower: cb11932084t
narrower: cb12345822h
narrower: cb17066537j
narrower: https://data.bnf.fr/ark:/12148/cb119412265
is part of: r166
broader: cb12121734h
narrower: https://data.bnf.fr/ark:/12148/cb119758341
narrower: cb11978023w

Simulazione <Matematica>