Toxicomanie
P61160: http://www.rdaregistry.info/termList/statIdentification/1001
type: Concept
alternative label: Accoutumance aux drogues
alternative label: Tossicodipendenza @it
narrower: https://data.bnf.fr/ark:/12148/cb122697751
domaine litteral: Problèmes et services sociaux. Criminologie
alternative label: Drogues -- Abus
domaine: https://data.bnf.fr/ark:/12148/cb119832928
narrower: cb11936459p
related: https://data.bnf.fr/ark:/12148/cb119319037
created: 1985-07-06
narrower: https://data.bnf.fr/ark:/12148/cb121560421
narrower: cb12234917k
related: cb12387593h
alternative label: Addiction
alternative label: Abus des drogues
related: https://data.bnf.fr/ark:/12148/cb119336883
alternative label: Pharmacodépendance
related: https://data.bnf.fr/ark:/12148/cb124530911
narrower: https://data.bnf.fr/ark:/12148/cb119528299
related: cb16630327h
related match: Drug abuse
narrower: https://data.bnf.fr/ark:/12148/cb122159898
alternative label: Pharmacomanie
modified: 2023-06-08
scope note: Voir aussi aux toxicomanies particulières, par ex. Opiomanie
narrower: https://data.bnf.fr/ark:/12148/cb119324660
is part of: r166
narrower: cb13776157x
FRBNF: 11933689
narrower: cb11964742x
related: cb11979786z
related match: Substance-Related Disorders
related: https://data.bnf.fr/ark:/12148/cb121404476
narrower: https://data.bnf.fr/ark:/12148/cb120787671
narrower: https://data.bnf.fr/ark:/12148/cb123507614
alternative label: Médicaments -- Accoutumance
alternative label: Drogues -- Dépendance
scope note: Voir aussi la subdivision Usage des drogues aux catégories de personnes, groupes ethniques et personnes
related: cb17930659m

Tossicodipendenza