Cultures potagères
related: cb16967638t
domaine litteral: Agriculture. Pêche
P61160: http://www.rdaregistry.info/termList/statIdentification/1001
related: cb11935560x
scope note: Sous cette vedette, on trouve les documents sur l'horticulture potagère. Les documents sur les jardins potagers se trouvent sous Jardins potagers
alternative label: Légumes -- Cultures potagères
broader: cb11964907z
is part of: r166
related: cb16641149q
alternative label: Cultures légumières
modified: 2023-06-07
related match: Vegetable gardening
created: 1985-07-06
type: Concept
related: https://data.bnf.fr/ark:/12148/cb119318289
alternative label: Horticulture potagère
FRBNF: 11933904