Idées politiques
narrower: cb13320451h
P61160: http://www.rdaregistry.info/termList/statIdentification/1001
narrower: https://data.bnf.fr/ark:/12148/cb11954236d
narrower: https://data.bnf.fr/ark:/12148/cb119542174
narrower: https://data.bnf.fr/ark:/12148/cb125067042
narrower: cb13318762q
narrower: https://data.bnf.fr/ark:/12148/cb17744755b
scope note: Voir aussi la subdivision Pensée politique et sociale aux catégories de personnes et personnes
narrower: cb12647612n
alternative label: Pensée politique
narrower: https://data.bnf.fr/ark:/12148/cb120984548
alternative label: Doctrines politiques
related: cb11934230x
related: https://data.bnf.fr/ark:/12148/cb119571256
narrower: https://data.bnf.fr/ark:/12148/cb15756318f
related: https://data.bnf.fr/ark:/12148/cb170255573
narrower: cb11949534j
created: 1985-07-06
related: cb11933106j
narrower: cb16216390m
narrower: cb15030040q
related: https://data.bnf.fr/ark:/12148/cb123113127
narrower: https://data.bnf.fr/ark:/12148/cb133408542
related match: Political science
narrower: cb11932330q
narrower: https://data.bnf.fr/ark:/12148/cb155447891
narrower: https://data.bnf.fr/ark:/12148/cb158291948
narrower: https://data.bnf.fr/ark:/12148/cb126480665
type: Concept
narrower: cb16945891x
narrower: https://data.bnf.fr/ark:/12148/cb119389702
narrower: cb14612334k
narrower: https://data.bnf.fr/ark:/12148/cb119343337
modified: 2023-06-07
narrower: https://data.bnf.fr/ark:/12148/cb178965126
narrower: https://data.bnf.fr/ark:/12148/cb119482156
broader: cb13319064q
narrower: https://data.bnf.fr/ark:/12148/cb119337395
narrower: https://data.bnf.fr/ark:/12148/cb12027733f
narrower: https://data.bnf.fr/ark:/12148/cb133185567
domaine: cb13319064q
alternative label: Théories politiques
alternative label: Idéologie politique
narrower: cb13318443m
narrower: https://data.bnf.fr/ark:/12148/cb178471698
narrower: cb12419535j
narrower: cb11948944q
narrower: cb12226508s
narrower: https://data.bnf.fr/ark:/12148/cb169836117
FRBNF: 11934231
related: cb11952235k
narrower: https://data.bnf.fr/ark:/12148/cb160554668
is part of: r166
related: cb11975806s
narrower: cb11978284n