Slovénie
long: 13.3833333333333
lat long: E 13°23' - E 16°37' / N 46°52'30" - N 45°25'48"
long: 16.6166666666667
lat: 46.875
type: SpatialThing
cadre geographique: cxbx
lat: 45.43

Slovénie
scope note: Voir aussi la subdivision Opinion publique slovène [sans subd. géogr.] aux guerres et aux lieux
related: https://data.bnf.fr/ark:/12148/cb12654033f
related: cb12199060h
narrower: cb11980783z
related: https://data.bnf.fr/ark:/12148/cb121619984
related: cb12293353s
related: https://data.bnf.fr/ark:/12148/cb12302520f
related: cb12315867v
related: https://data.bnf.fr/ark:/12148/cb123158655
broader: cb12021360s
FRBNF: 11934437
narrower: https://data.bnf.fr/ark:/12148/cb16511006c
type: Concept
is part of: r167
related: https://data.bnf.fr/ark:/12148/cb133234052
narrower: https://data.bnf.fr/ark:/12148/cb171665638
modified: 2017-02-13
narrower: cb15543248t
narrower: https://data.bnf.fr/ark:/12148/cb160789016
related: https://data.bnf.fr/ark:/12148/cb120479233
broader: https://data.bnf.fr/ark:/12148/cb11934129f
related: https://data.bnf.fr/ark:/12148/cb12165500f
related: cb13323395k
related: cb14578338g
created: 1985-07-06
related: cb11947644n
P61160: http://www.rdaregistry.info/termList/statIdentification/1001
scope note: Voir aussi la subdivision Et la Slovénie [sans subd. géogr.] aux collectivités (à l'exception des types de collectivités) et aux personnes
domaine litteral: Géographie de l'Europe

Slovénie
alternative label: Slovenija @sl
alternative label: Slovénie (1991-)
created: 1997-02-28
P61160: http://www.rdaregistry.info/termList/statIdentification/1001
FRBNF: 15325756
broader: cb15307742x
modified: 2006-12-11
focus: Slovénie
alternative label: Slovenija (1991-) @sl
type: Concept

Slovenia