Art -- Philosophie
scope note: Sous cette vedette, on trouve les documents sur la philosophie de l'art. Les documents sur les relations entre la philosophie et l'art se trouvent sous Philosophie et art
modified: 2023-06-07
is part of: r166
alternative label: Philosophie de l'art
related: cb13178109h
created: 1985-07-06
domaine: https://data.bnf.fr/ark:/12148/cb119368422
related: cb11934758p
related match: Art--Philosophy
type: Concept
narrower: https://data.bnf.fr/ark:/12148/cb119600483
P61160: http://www.rdaregistry.info/termList/statIdentification/1001
FRBNF: 11934760
domaine: cb11934758p
related: cb11931288h