Athènes (Grèce)
type: SpatialThing
cadre geographique: cxapaa
long: 23.7333333333333
lat long: E 23°44' / N 38°
cadre geographique: cxap
lat: 38.0

Athènes (Grèce)
is part of: r167
created: 1985-07-06
related: https://data.bnf.fr/ark:/12148/cb124350437
type: Concept
related: cb15805272v
broader: https://data.bnf.fr/ark:/12148/cb12497967f
FRBNF: 11936474
P61160: http://www.rdaregistry.info/termList/statIdentification/1001
scope note: Voir aussi la subdivision Et Athènes aux collectivités et personnes
domaine litteral: Géographie de l'Europe
editorial note: Grand Larousse universel. - . - Encycl. universalis. - http://www.universalis-edu.com. - 2008-10-17 Atlas universel Le Monde, 2000. - . -
note: Capitale de la Grèce depuis le 1er décembre 1834
modified: 2008-10-17

Athènes (Grèce)
modified: 2014-06-06
P61160: http://www.rdaregistry.info/termList/statIdentification/1001
type: Concept
alternative label: Athènes
alternative label: Atheniae (Grèce) @la
broader: cb15238445t
alternative label: Athënai (Grèce)
alternative label: Athinai (Grèce)
focus: Athènes (Grèce)
FRBNF: 15242070
alternative label: Athina (Grèce) @el
created: 1990-04-12
alternative label: Athênai (Grèce)
alternative label: Athens (Grèce) @en