Patinage
editorial note: Nouveau petit Robert 1993. - . - Robert des sports : dict. de la langue des sports / G. Petiot, 1982. - . -
P61160: http://www.rdaregistry.info/termList/statIdentification/1001
alternative label: Patinage artistique
narrower: https://data.bnf.fr/ark:/12148/cb120099948
narrower: https://data.bnf.fr/ark:/12148/cb11955572b
type: Concept
created: 1985-07-06
is part of: r166
domaine litteral: Sports et jeux
scope note: Sous cette vedette, on trouve les documents sur le patinage, en général, et sur le patinage sur glace, en particulier
related match: Skating
alternative label: Patinage sur glace
narrower: https://data.bnf.fr/ark:/12148/cb137695984
related: https://data.bnf.fr/ark:/12148/cb12457822c
FRBNF: 11937404
related match: Figure skating
modified: 2023-06-07
broader: cb12000950g
related: https://data.bnf.fr/ark:/12148/cb119789628