Orient et Occident
alternative label: Asie et Occident
alternative label: Orient -- Opinion publique occidentale
related: cb12653985x
alternative label: Civilisation occidentale -- Influence orientale
is part of: r166
alternative label: Orient -- Relations -- Occident
alternative label: Occident et Asie
alternative label: Occident -- Opinion publique orientale
narrower: cb15542359h
alternative label: Relations entre Orient et Occident
alternative label: Occident et Orient
alternative label: Civilisation orientale -- Influence occidentale
related: cb13318305s
alternative label: Occident -- Relations -- Orient
FRBNF: 11937591
domaine: https://data.bnf.fr/ark:/12148/cb119344445
related: cb11978982w
created: 1985-07-06
alternative label: Civilisation occidentale -- Influence asiatique
related: https://data.bnf.fr/ark:/12148/cb11977106b
alternative label: Asie -- Civilisation -- Influence occidentale
type: Concept
modified: 2018-12-07
is part of: r167
related: https://data.bnf.fr/ark:/12148/cb150357447
P61160: http://www.rdaregistry.info/termList/statIdentification/1001
related: https://data.bnf.fr/ark:/12148/cb119799588
scope note: Sous cette vedette, on trouve les documents sur les relations entre les civilisations orientale et occidentale
related: cb11975539x
related match: East and West
alternative label: Est et Ouest