Camping
is part of: r166
scope note: Sous cette vedette, on trouve les documents sur l'activité de loisir consistant à vivre en plein air, sous la tente. Les documents sur les terrains aménagés pour la pratique de cette activité se trouvent sous Terrains de camping
type: Concept
alternative label: Hôtellerie de plein air
alternative label: Campeggi @it
related: https://data.bnf.fr/ark:/12148/cb13319063c
related: https://data.bnf.fr/ark:/12148/cb131627728
broader: https://data.bnf.fr/ark:/12148/cb131626871
alternative label: Vacances sous la tente
alternative label: Camping-caravaning
P61160: http://www.rdaregistry.info/termList/statIdentification/1001
created: 1985-07-06
domaine litteral: Sports et jeux
narrower: cb11973335h
related: cb11959609t
related: cb11931824x
related: cb13164910r
FRBNF: 11937783
modified: 2018-09-11

Camping

Campeggi