Bouddhisme
related: cb11945360k
modified: 2023-06-08
related: cb11982928v
FRBNF: 11938935
narrower: cb12240533z
narrower: https://data.bnf.fr/ark:/12148/cb119419906
narrower: cb11980170z
created: 1985-07-06
related: cb12476432r
related: cb12320448g
narrower: https://data.bnf.fr/ark:/12148/cb119604188
related: https://data.bnf.fr/ark:/12148/cb119319246
narrower: https://data.bnf.fr/ark:/12148/cb119420303
narrower: cb11979935m
related: cb11960570n
scope note: L'adjectif de religion correspondant est "bouddhique"
related: https://data.bnf.fr/ark:/12148/cb11993120b
narrower: cb11965154h
domaine: cb11963568t
narrower: https://data.bnf.fr/ark:/12148/cb12038353d
related: cb12652375q
scope note: S'emploie également en subdivision. Cette subdivision s'applique aux sujets religieux
narrower: cb12232486j
is part of: r166
related: cb12475469v
narrower: https://data.bnf.fr/ark:/12148/cb119650965
related: https://data.bnf.fr/ark:/12148/cb16561373c
narrower: cb11977072v
related: cb15504345g
editorial note: Nouveau petit Robert 2010. - . - Dict. des religions / P. Poupard, 1984. - . -
related: cb15593876r
P61160: http://www.rdaregistry.info/termList/statIdentification/1001
narrower: https://data.bnf.fr/ark:/12148/cb12099114f
narrower: cb11946173m
narrower: cb12333257t
scope note: Voir aussi la subdivision Interprétations bouddhiques aux livres sacrés
narrower: cb12499113s
narrower: cb12176683p
narrower: https://data.bnf.fr/ark:/12148/cb119668253
broader: https://data.bnf.fr/ark:/12148/cb119346708
related: https://data.bnf.fr/ark:/12148/cb119474114
related: cb12123297h
narrower: cb16677846p
narrower: cb11979560q
alternative label: Et le bouddhisme
type: Concept
related: https://data.bnf.fr/ark:/12148/cb121028082
narrower: https://data.bnf.fr/ark:/12148/cb123809948
narrower: https://data.bnf.fr/ark:/12148/cb12476716b
related: cb12270052g
narrower: https://data.bnf.fr/ark:/12148/cb119750564
related: https://data.bnf.fr/ark:/12148/cb123844220

Buddhism