Enseignement supérieur
related match: Education (Higher)
narrower: https://data.bnf.fr/ark:/12148/cb131913538
narrower: cb12069469x
narrower: cb16931379h
narrower: https://data.bnf.fr/ark:/12148/cb11953348f
narrower: https://data.bnf.fr/ark:/12148/cb166474866
narrower: https://data.bnf.fr/ark:/12148/cb122741385
alternative label: Études universitaires
narrower: cb11952392p
is part of: r166
narrower: https://data.bnf.fr/ark:/12148/cb123464021
narrower: cb15021395v
narrower: cb15596949v
narrower: https://data.bnf.fr/ark:/12148/cb11935381b
narrower: https://data.bnf.fr/ark:/12148/cb119767100
related: cb11975800q
narrower: cb17166113m
type: Concept
alternative label: Enseignement universitaire
narrower: https://data.bnf.fr/ark:/12148/cb11950969b
scope note: Voir aussi la subdivision Étude et enseignement (supérieur) [+ subd géogr.] à tous sujets noms communs et noms propres
modified: 2023-06-07
narrower: cb13164234t
narrower: cb18091956g
FRBNF: 11939974
narrower: cb16722603s
narrower: cb16235886x
scope note: S'emploie également en subdivision. Cette subdivision s'applique aux catégories de personnes et groupes ethniques, par ex. : Handicapés -- Enseignement supérieur
narrower: https://data.bnf.fr/ark:/12148/cb120629688
narrower: https://data.bnf.fr/ark:/12148/cb13319688c
domaine: cb13318807v
editorial note: Nouveau petit Robert 2010. - . - Dict. de l'éducation / A. van Zanten, 2008. - . -
related match: Study and teaching (Higher)
narrower: cb16261441h
narrower: cb16967451g
related: cb12005562k
narrower: cb12461631j
narrower: https://data.bnf.fr/ark:/12148/cb120737801
related: https://data.bnf.fr/ark:/12148/cb11933731d
narrower: cb13189833r
related: cb11933987k
narrower: https://data.bnf.fr/ark:/12148/cb169681678
narrower: https://data.bnf.fr/ark:/12148/cb120379874
narrower: cb11971055t
P61160: http://www.rdaregistry.info/termList/statIdentification/1001
created: 1985-07-06
narrower: https://data.bnf.fr/ark:/12148/cb136147550
alternative label: Enseignement post-secondaire
narrower: https://data.bnf.fr/ark:/12148/cb11950915d
alternative label: Supérieur (enseignement)
narrower: https://data.bnf.fr/ark:/12148/cb126524332
related: https://data.bnf.fr/ark:/12148/cb11935294d
related: cb11949024v
alternative label: Études supérieures
narrower: cb13757782m
narrower: https://data.bnf.fr/ark:/12148/cb11978427c