Papouasie-Nouvelle-Guinée
long: 140.833333333333
lat long: E 140°50' - E 159°41' / S 33' - S 11°51'
type: SpatialThing
lat: -0.55
cadre geographique: cyh
long: 159.683333333333
lat: -11.85

Papouasie-Nouvelle-Guinée
broader: cb11932474m
editorial note: IFLA, Names of states, 1981. - . - SY 2000. - . - GLU. - . -
scope note: La Papouasie-Nouvelle-Guinée, indépendante depuis le 16-09-1975, comprend l'ancienne Nouvelle-Guinée allemande, placée en 1921 sous mandat australien, et la Papouasie, britannique depuis 1884
related: https://data.bnf.fr/ark:/12148/cb135165087
type: Concept
created: 1985-07-06
domaine litteral: Géographie du reste du monde
FRBNF: 11941180
P61160: http://www.rdaregistry.info/termList/statIdentification/1001
related: cb11976860t
related: https://data.bnf.fr/ark:/12148/cb126484470
is part of: r167
related: https://data.bnf.fr/ark:/12148/cb120460957
modified: 2017-12-21

Papouasie-Nouvelle-Guinée
modified: 2018-09-24
P61160: http://www.rdaregistry.info/termList/statIdentification/1001
alternative label: Papua New Guinea @en
related: cb15376462x
created: 2002-07-19
focus: Papouasie-Nouvelle-Guinée
alternative label: Papouasie-Nouvelle-Guinée (1975-)
FRBNF: 15376461
type: Concept