Malte
cadre geographique: cxaw
lat long: E 14°10'49" - E 14°34'30" / N 36°4'54" - N 35°48'15"
long: 14.1802777777778
long: 14.575
lat: 36.0816666666667
lat: 35.8041666666667
type: SpatialThing

Malte
narrower: https://data.bnf.fr/ark:/12148/cb177625562
broader: https://data.bnf.fr/ark:/12148/cb119563036
related: cb12004818p
domaine litteral: Géographie de l'Europe
related: cb12302690w
scope note: Sous cette vedette on trouve les ouvrages qui traitent de l'archipel de Malte, formant un État insulaire méditerranéen de l'Union européenne, ou de la seule île de Malte
FRBNF: 11945055
type: Concept
related: cb11963138s
broader: https://data.bnf.fr/ark:/12148/cb177625609
is part of: r167
modified: 2018-09-26
editorial note: L'atlas National geographic, 2007. - . - Petit Robert des noms propres 2015. - . - Grand Larousse universel. - . -
related: cb14589593m
created: 1985-07-06
broader: https://data.bnf.fr/ark:/12148/cb11934129f
P61160: http://www.rdaregistry.info/termList/statIdentification/1001

Malte
broader: cb15307742x
narrower: cb15302030s
alternative label: Archipel Maltais
alternative label: Repubblika Ta'Malta @mt
alternative label: République de Malte
alternative label: Mālṭah (île) @ar
alternative label: Repubblika taʼ Malta @mt
FRBNF: 15302032
type: Concept
narrower: cb15302029k
alternative label: Malta @mt
narrower: cb15302024v
alternative label: Malita (île) @ar
created: 1993-07-02
narrower: https://data.bnf.fr/ark:/12148/cb153020314
modified: 2020-08-07
focus: Malte
narrower: cb15302026j
alternative label: Maltese Islands @en
alternative label: Malte (île)
alternative label: Melitê (île)
alternative label: Republic of Malta @en
P61160: http://www.rdaregistry.info/termList/statIdentification/1001
alternative label: Archipel maltais

Malta