Golfe Persique (Océan Indien)
lat: 27.0
long: 51.0
type: SpatialThing
lat long: E 51° / N 27°
cadre geographique: bdf

Persique, Golfe
is part of: r167
editorial note: GDEL. - . - Laval RVM, 1990-08. - . - Persian Gulf ; LCSH, 1990-06. - . -
created: 1985-07-06
P61160: http://www.rdaregistry.info/termList/statIdentification/1001
broader: cb11945454x
modified: 1992-02-05
broader: https://data.bnf.fr/ark:/12148/cb120484249
FRBNF: 11935572
type: Concept

Persique, Golfe (région)
P61160: http://www.rdaregistry.info/termList/statIdentification/1001
narrower: https://data.bnf.fr/ark:/12148/cb119320855
scope note: Sous cette vedette, on trouve les ouvrages sur les pays riverains du golfe Persique : Iran, Irak, Arabie saoudite, émirats arabes (Bahreïn, Émirats arabes unis, Koweït, Qatar) et sultanat d'Oman. Les ouvrages qui ne traitent que des émirats et du sultanat d'Oman se trouvent sous la vedette Pays du golfe Persique
created: 1985-07-06
FRBNF: 11945649
narrower: cb11934242x
narrower: cb11930929p
narrower: Pays du golfe Persique
modified: 1991-01-10
broader: https://data.bnf.fr/ark:/12148/cb11941591f
type: Concept
is part of: r167

Golfe Persique (Océan Indien)
alternative label: États du golfe Persique
alternative label: Golfe Persique, Pays du
modified: 2023-07-07
alternative label: Persique, Pays du golfe
alternative label: Arabo-persique, Golfe
P61160: http://www.rdaregistry.info/termList/statIdentification/1001
focus: Golfe Persique (Océan Indien)
alternative label: Golfe Persique
alternative label: Golfe Persique (région)
alternative label: Golfe Arabique (Océan Indien)
alternative label: Émirats du golfe Persique
FRBNF: 15345105
created: 1999-08-25
type: Concept
alternative label: Golfe Arabo-persique
alternative label: Persique, Région du golfe

Pays du golfe Persique
narrower: cb11943001r
scope note: Sous cette vedette, on trouve les ouvrages traitent de la partie de l'Arabie formée par le Koweït, Bahreïn, le Qatar, les Émirats arabes unis et Oman. Les ouvrages qui incluent aussi l'Arabie saoudite, l'Irak et l'Iran se trouvent sous la vedette Persique, Golfe (région)
type: Concept
is part of: r167
broader: cb11941820r
narrower: cb11939913g
narrower: https://data.bnf.fr/ark:/12148/cb119457077
modified: 1991-01-10
narrower: https://data.bnf.fr/ark:/12148/cb119794070
created: 1985-07-06
broader: Persique, Golfe (région)
narrower: cb11940436s
P61160: http://www.rdaregistry.info/termList/statIdentification/1001
FRBNF: 11945648