Assurance
narrower: cb12147591n
narrower: cb11974686g
narrower: cb11967805q
broader: cb11961031m
related: cb12088831h
narrower: https://data.bnf.fr/ark:/12148/cb125129323
narrower: https://data.bnf.fr/ark:/12148/cb119720014
narrower: cb16027597p
type: Concept
alternative label: Assurances terrestres
narrower: https://data.bnf.fr/ark:/12148/cb166588811
scope note: Voir aussi la subdivision Assurances aux catégories de personnes et industries
created: 1985-07-06
modified: 2023-06-07
narrower: cb11967869z
related: https://data.bnf.fr/ark:/12148/cb16954814f
P61160: http://www.rdaregistry.info/termList/statIdentification/1001
narrower: cb12147500h
FRBNF: 11949840
is part of: r166
related match: Insurance
narrower: https://data.bnf.fr/ark:/12148/cb126500355
narrower: https://data.bnf.fr/ark:/12148/cb166018145
narrower: cb11934328n
scope note: Voir aussi les vedettes commençant par le mot Assurance
related: https://data.bnf.fr/ark:/12148/cb137393472
narrower: cb17014389q