Taïwan
long: 120.0
long: 121.8
cadre geographique: cwbx
type: SpatialThing
lat: 21.9
lat long: E 120° - E 121°48' / N 25°13' - N 21°54'
lat: 25.2166666666667

Taiwan
is part of: r167
related: https://data.bnf.fr/ark:/12148/cb170339061
scope note: Sous cette vedette on trouve les ouvrages qui traitent de l'île de Taiwan et/ou de la République de Chine ; en précision géographique, employer la forme (Taiwan), par ex. Gaoxiong (Taiwan). Les ouvrages sur les organismes administratifs centraux de la République et du Gouvernement provincial se trouvent respectivement sous les vedettes Chine (République) et Taiwan (Province) suivies de la sous-vedette appropriée, par ex. Chine (République). Overseas Chinese Affairs Commission ; Taiwan (Province). Department of Information
related: cb12153909z
modified: 1997-02-11
created: 1985-07-06
related: cb17726497h
P61160: http://www.rdaregistry.info/termList/statIdentification/1001
broader: https://data.bnf.fr/ark:/12148/cb119528028
type: Concept
FRBNF: 11949898

Taïwan
FRBNF: 15281841
alternative label: T′aiwan
focus: Taïwan
alternative label: Chine (République)
alternative label: Formose
modified: 2021-12-02
P61160: http://www.rdaregistry.info/termList/statIdentification/1001
alternative label: Chine nationaliste
created: 1990-08-23
type: Concept
alternative label: Taïwan (1949-)