Catalogne (Espagne)
alternative label: Mancomunidad de Cataluña @es
scope note: Sous cette vedette, on trouve les ouvrages qui traitent de l'ensemble de la Catalogne jusqu'en 1659 (date de la cession à la France du Roussillon et d'une partie de la Cerdagne) ou de la Catalogne espagnole depuis cette date. Les ouvrages qui ne traitent que de la Catalogne française se trouvent sous la vedette Roussillon (France)
narrower: https://data.bnf.fr/ark:/12148/cb165959530
narrower: https://data.bnf.fr/ark:/12148/cb16572570b
broader: cb12009262q
narrower: cb11934783w
created: 1985-07-06
alternative label: Généralité de Catalogne
alternative label: Catalogne
editorial note: GLU. - . - Mourre. - . -
related: cb16079306h
narrower: https://data.bnf.fr/ark:/12148/cb119767898
alternative label: Cataluña (Espagne) @es
related: cb16055386m
type: Concept
alternative label: Catalunya (Espagne) @ca
note: Ancien comté, aujourd'hui Communauté autonome ou Généralité, qui regroupe les provinces de Barcelone, Gérone, Lérida et Tarragone
narrower: cb12141923t
modified: 2017-02-13
narrower: cb11942534v
alternative label: Mancomunitat de Catalunya @ca
FRBNF: 11950591
related: cb11942483s
related: cb11946627t
note: Les noms géographiques de la Généralité de Catalogne pour lesquels il n'existe pas de forme française couramment attestée doivent être pris en catalan de préférence à leur forme castillane
P61160: http://www.rdaregistry.info/termList/statIdentification/1001
narrower: https://data.bnf.fr/ark:/12148/cb12063361f
alternative label: Generalidad de Cataluña @es
is part of: r167
alternative label: Generalitat de Catalunya @ca
broader: cb12236937p
domaine litteral: Géographie de l'Europe

Catalonia (Spain)