Services
narrower: https://data.bnf.fr/ark:/12148/cb16531372d
created: 1985-07-06
alternative label: Industries de services
alternative label: Services aux entreprises
type: Concept
alternative label: Industrie des services
narrower: cb13318422n
related: https://data.bnf.fr/ark:/12148/cb119804071
domaine litteral: Économie politique. Travail
alternative label: Services marchands
narrower: https://data.bnf.fr/ark:/12148/cb12527147b
alternative label: Services (activités tertiaires)
is part of: r166
related: https://data.bnf.fr/ark:/12148/cb166824697
narrower: https://data.bnf.fr/ark:/12148/cb119653035
narrower: cb11940090g
narrower: cb16546290g
scope note: Voir aussi aux commerces et industries de services, par ex. : Blanchissage -- Industrie et commerce ; Boulangeries
alternative label: Activités tertiaires
narrower: https://data.bnf.fr/ark:/12148/cb133191791
narrower: https://data.bnf.fr/ark:/12148/cb17048194b
FRBNF: 11951149
P61160: http://www.rdaregistry.info/termList/statIdentification/1001
alternative label: Services (industrie)
alternative label: Prestataires de services
narrower: cb17148901w
narrower: https://data.bnf.fr/ark:/12148/cb166015835
modified: 2023-06-08
narrower: cb15095324r
alternative label: Tertiaire (économie politique)
alternative label: Secteur tertiaire
narrower: cb11978291x

Service industries