Colonnes
alternative label: Colonnes votives
P61160: http://www.rdaregistry.info/termList/statIdentification/1001
narrower: cb16956858j
scope note: Voir aussi aux noms des colonnes particulières, par ex. : Paris (France) -- Colonne Vendôme ; Rome (Italie) -- Colonna Traiana
related: https://data.bnf.fr/ark:/12148/cb136010643
editorial note: Architecture : méthode et vocabulaire / Ministère des affaires culturelles, Inventaire général des monuments et des richesses artistiques de la France, 1972. - . - Dict. des termes d'art et d'archéologie / J. Girard, 2007. - . - Dicobat 10 / J. de Vigan, 2011. - . -
type: Concept
narrower: https://data.bnf.fr/ark:/12148/cb171654496
narrower: cb16766391v
FRBNF: 11955249
narrower: https://data.bnf.fr/ark:/12148/cb136003024
narrower: https://data.bnf.fr/ark:/12148/cb16766170b
narrower: cb11980812q
narrower: cb11931153k
alternative label: Colonne @it
narrower: https://data.bnf.fr/ark:/12148/cb11980811c
created: 1985-07-06
narrower: https://data.bnf.fr/ark:/12148/cb125029368
is part of: r166
broader: cb11977661v
related: https://data.bnf.fr/ark:/12148/cb15093219d
alternative label: Piliers
related: cb11996035t
narrower: https://data.bnf.fr/ark:/12148/cb11978692c
narrower: https://data.bnf.fr/ark:/12148/cb171654554
narrower: cb16768749n
related: cb11983013k
related: cb12218390j
related: cb11948497x
narrower: cb12502932w
modified: 2023-06-08
domaine: https://data.bnf.fr/ark:/12148/cb133183211

Colonne

Columns