Enfants -- Maladies
alternative label: Maladies infantiles
related match: Children--Diseases
FRBNF: 11961363
narrower: https://data.bnf.fr/ark:/12148/cb145887619
alternative label: Maladies des enfants
narrower: https://data.bnf.fr/ark:/12148/cb165831742
scope note: Voir aussi la subdivision Chez l'enfant aux maladies
related: cb11933050r
related: https://data.bnf.fr/ark:/12148/cb121242178
narrower: cb18013542h
type: Concept
scope note: Sous cette vedette, on trouve les documents sur les maladies des enfants. Les documents sur la discipline elle-même se trouvent sous Pédiatrie
domaine: https://data.bnf.fr/ark:/12148/cb119832928
P61160: http://www.rdaregistry.info/termList/statIdentification/1001
narrower: https://data.bnf.fr/ark:/12148/cb119613663
narrower: https://data.bnf.fr/ark:/12148/cb123607829
created: 1985-07-06
narrower: https://data.bnf.fr/ark:/12148/cb11939420c
modified: 2023-06-07
narrower: https://data.bnf.fr/ark:/12148/cb124736379
broader: cb11958830z
related: https://data.bnf.fr/ark:/12148/cb119772089
is part of: r166
alternative label: Maladies -- Chez l'enfant