Indice des prix à la consommation
alternative label: Coût et niveau de la vie -- Indices
scope note: Sous cette vedette, on trouve les documents sur l'élaboration de l'indice des prix à la consommation et sur l'indice lui-même . Dans ce cas, une 2e indexation est faite à la vedette Prix
broader: https://data.bnf.fr/ark:/12148/cb13318683d
alternative label: Prix de détail -- Indices
type: Concept
broader: https://data.bnf.fr/ark:/12148/cb119618534
created: 1985-07-06
broader: cb11934136q
alternative label: Prix à la consommation -- Indices
P61160: http://www.rdaregistry.info/termList/statIdentification/1001
modified: 2018-12-07
domaine litteral: Économie politique. Travail
is part of: r166
related match: Consumer price indexes
FRBNF: 11961854