France -- Ancien régime
alternative label: Ancien régime (France)
narrower: cb11970719n
scope note: Voir aussi la subdivision chronologique affranchie 1500-1800 [sans subd. géogr.] sous les vedettes de sujet et de noms de lieux situés en France, par ex. : Éducation des filles -- France -- 1500-1800 ; Limousin (France) -- Politique et gouvernement -- 1500-1800
is part of: r166
created: 1985-07-06
alternative label: France -- 16e-18e siècles
narrower: cb11941847s
narrower: https://data.bnf.fr/ark:/12148/cb120504388
is part of: r167
related: cb11935228m
related: https://data.bnf.fr/ark:/12148/cb11941846f
narrower: https://data.bnf.fr/ark:/12148/cb120916126
related: https://data.bnf.fr/ark:/12148/cb11943496c
P61160: http://www.rdaregistry.info/termList/statIdentification/1001
modified: 2020-10-26
broader: https://data.bnf.fr/ark:/12148/cb11931522d
narrower: cb12078346z
narrower: https://data.bnf.fr/ark:/12148/cb131923436
type: Concept
narrower: https://data.bnf.fr/ark:/12148/cb119434982
FRBNF: 11962861
domaine litteral: Histoire de la France