Salubrité publique
alternative label: Services sanitaires
related: cb11982525q
domaine: cb11933639w
related match: Sanitation
created: 1985-07-06
broader: https://data.bnf.fr/ark:/12148/cb119332195
is part of: r166
related: cb11976184w
scope note: Voir aussi la subdivision Salubrité aux industries et sujets noms communs appropriés (types de constructions, d'équipements, etc.) pour l'organisation des conditions de l'environnement en vue de favoriser la santé
domaine: https://data.bnf.fr/ark:/12148/cb119832928
type: Concept
narrower: https://data.bnf.fr/ark:/12148/cb119319126
P61160: http://www.rdaregistry.info/termList/statIdentification/1001
narrower: cb11971562g
modified: 2023-06-07
narrower: https://data.bnf.fr/ark:/12148/cb119523513
narrower: cb12234065z
FRBNF: 11973582