Dieu
related: cb12356569s
is part of: r166
narrower: cb11931321h
related: https://data.bnf.fr/ark:/12148/cb119479105
related: cb11942353k
type: Concept
alternative label: Être suprême
related: cb11963453h
related: cb11969140s
alternative label: Dieu (philosophie)
scope note: Peut se subdiviser par religion, confession ou secte
related: cb11937191k
narrower: cb12651817p
alternative label: Contribution à l'idée de dieu
P61160: http://www.rdaregistry.info/termList/statIdentification/1001
alternative label: Dieu -- Philosophie
domaine: cb11963568t
related: cb11965575k
broader: cb11963568t
related: cb11976631p
modified: 2022-12-19
related: cb11965588x
related: https://data.bnf.fr/ark:/12148/cb12099114f
related: https://data.bnf.fr/ark:/12148/cb119669408
narrower: https://data.bnf.fr/ark:/12148/cb119485318
related: cb11951726r
broader: cb11934604g
related: cb16554513k
related: https://data.bnf.fr/ark:/12148/cb119752858
related: cb11960407m
related: https://data.bnf.fr/ark:/12148/cb11946169c
FRBNF: 11975724
related: cb16745395k
note: Sous cette vedette, on trouve les documents sur l'idée de Dieu, entendue d'un point de vue général et/ou plus particulièrement philosophique
related: https://data.bnf.fr/ark:/12148/cb16252509b
scope note: S'emploie également en subdivision
related: cb12269725g
related: cb11942372v
related: cb11960416k
related: cb13319154p
alternative label: Idée de Dieu
domaine: https://data.bnf.fr/ark:/12148/cb119368422
created: 1985-07-06

God