Gestion des conflits
related: https://data.bnf.fr/ark:/12148/cb11950843c
broader: cb11941985m
scope note: Sous cette vedette, on trouve les ouvrages sur la gestion et la résolution des conflits au sein des organisations, entreprises, etc.
is part of: r166
narrower: cb12249243m
narrower: cb17809415t
broader: cb13318626k
P61160: http://www.rdaregistry.info/termList/statIdentification/1001
type: Concept
created: 1985-07-06
alternative label: Résolution de conflits
narrower: cb11977381n
related match: Conflict management
broader: cb11950206h
related: cb15625764p
modified: 2018-09-11
FRBNF: 11975960
alternative label: Conflits, Gestion des
related: cb12289494w