Églises protestantes
related match: Protestant churches
narrower: https://data.bnf.fr/ark:/12148/cb11934574c
scope note: Sous cette vedette, on trouve les ouvrages sur l'ensemble des dénominations protestantes ainsi que les ouvrages sur les dénominations protestantes particulières que l'on ne peut identifier
FRBNF: 11976087
related: cb11960495q
narrower: https://data.bnf.fr/ark:/12148/cb122716840
is part of: r166
narrower: https://data.bnf.fr/ark:/12148/cb123233525
P61160: http://www.rdaregistry.info/termList/statIdentification/1001
narrower: cb16052352k
narrower: https://data.bnf.fr/ark:/12148/cb122945120
modified: 2023-06-08
related: cb12078549j
related: https://data.bnf.fr/ark:/12148/cb119522525
narrower: cb11963420j
related: https://data.bnf.fr/ark:/12148/cb119346212
alternative label: Chiese protestanti @it
type: Concept
related: cb11934620q
narrower: https://data.bnf.fr/ark:/12148/cb17787116b
broader: cb13318467m
narrower: cb11938557r
related: cb16709448g
scope note: Voir aussi aux différentes dénominations protestantes, par ex. : Église luthérienne
narrower: cb11933885m
created: 1985-07-06
domaine: cb11963568t
scope note: S'emploie également en subdivision aux sujets religieux
narrower: https://data.bnf.fr/ark:/12148/cb119522467

Chiese protestanti