Traductions
type: Concept
scope note: Voir aussi la subdivision Versions aux livres sacrés
related: cb11976468g
modified: 2020-09-18
created: 1985-07-06
narrower: https://data.bnf.fr/ark:/12148/cb124039381
is part of: r166
domaine litteral: Linguistique générale
related: https://data.bnf.fr/ark:/12148/cb119336910
related: https://data.bnf.fr/ark:/12148/cb125492941
alternative label: Traductions en langues étrangères
FRBNF: 11976142
related: https://data.bnf.fr/ark:/12148/cb123413941
scope note: Voir aussi les subdivisions du type Traductions [adjectif de langue] aux littératures, personnes, titres et sujets noms communs appropriés (types d'imprimés ou d'écrits, domaines, etc.)
scope note: Voir aussi la subdivision Traductions interlinéaires aux livres sacrés
scope note: S'emploie également en subdivision
alternative label: Traduzioni @it
P61160: http://www.rdaregistry.info/termList/statIdentification/1001

Translations

Traduzioni