Histoire des unités
alternative label: Histoire des régiments
related: https://data.bnf.fr/ark:/12148/cb119670285
scope note: S'emploie uniquement en subdivision aux guerres
P61160: http://www.rdaregistry.info/termList/statIdentification/1001
is part of: r166
alternative label: Unités combattantes
FRBNF: 11976237
scope note: Voir aussi aux noms des formations militaires, par ex. : France. Armée. Régiment d'infanterie (119e)
created: 1985-07-06
modified: 2019-06-21
type: Concept
related match: Regimental histories
related: cb12650437z
domaine: https://data.bnf.fr/ark:/12148/cb133183002