Équipements sanitaires
alternative label: Santé, Installations de
narrower: https://data.bnf.fr/ark:/12148/cb13506699f
narrower: cb16221033z
related match: Health facilities
alternative label: Institutions sanitaires
narrower: https://data.bnf.fr/ark:/12148/cb155645218
domaine litteral: Urbanisme. Architecture du paysage
narrower: cb11940402g
related match: Health Facilities
is part of: r166
modified: 2018-12-07
narrower: https://data.bnf.fr/ark:/12148/cb169906691
scope note: Voir aussi la subdivision Services de santé aux collectivités et forces armées
narrower: cb12546127w
narrower: cb16991560w
related: cb11971628k
narrower: cb11982297r
narrower: cb12234936v
narrower: https://data.bnf.fr/ark:/12148/cb14410513b
narrower: cb13196176k
narrower: cb12209465n
alternative label: Établissements sanitaires et sociaux
domaine: https://data.bnf.fr/ark:/12148/cb133183211
related: https://data.bnf.fr/ark:/12148/cb169961035
alternative label: Établissements de soins
alternative label: Établissements de santé
related: https://data.bnf.fr/ark:/12148/cb119332195
alternative label: Santé, Équipements de
narrower: https://data.bnf.fr/ark:/12148/cb119519536
narrower: https://data.bnf.fr/ark:/12148/cb122349314
related: https://data.bnf.fr/ark:/12148/cb11974352b
scope note: Voir aussi la subdivision Soins médicaux aux catégories de personnes, forces armées, groupes ethniques et guerres
related: cb11971647v
alternative label: Équipements de santé
domaine: https://data.bnf.fr/ark:/12148/cb119361544
domaine: https://data.bnf.fr/ark:/12148/cb119832928
narrower: cb13318656h
alternative label: Installations de santé
related: cb16952661x
broader: https://data.bnf.fr/ark:/12148/cb119377452
narrower: cb11983245r
alternative label: Équipements médicaux
alternative label: Installations médicales
narrower: cb11962009p
type: Concept
alternative label: Institutions de santé
narrower: https://data.bnf.fr/ark:/12148/cb166613292
FRBNF: 11977091
narrower: https://data.bnf.fr/ark:/12148/cb11977476b
narrower: https://data.bnf.fr/ark:/12148/cb11967837b
narrower: cb12266508m
created: 1985-07-06
P61160: http://www.rdaregistry.info/termList/statIdentification/1001