Stades
broader: cb11936639m
FRBNF: 11977316
domaine litteral: Sports et jeux
alternative label: Stades omnisports
related match: Stadiums
narrower: cb12397004w
created: 1985-07-06
alternative label: Stades olympiques
P61160: http://www.rdaregistry.info/termList/statIdentification/1001
is part of: r166
alternative label: Enceintes sportives
domaine: https://data.bnf.fr/ark:/12148/cb119361544
editorial note: Nouveau petit Robert 1993. - . - Dict. Larousse. - http://www.larousse.fr. - 2013-03-20
type: Concept
modified: 2018-09-11
scope note: Voir aussi au nom des stades, par ex. : Saint-Denis (Seine-Saint-Denis) -- Stade de France