États-Unis -- 1861-1865 (Guerre de Sécession)
alternative label: Guerre civile américaine
narrower: https://data.bnf.fr/ark:/12148/cb122322682
alternative label: Guerre de Sécession (États-Unis)
narrower: https://data.bnf.fr/ark:/12148/cb125463383
type: Concept
narrower: https://data.bnf.fr/ark:/12148/cb131953490
FRBNF: 11979576
focus: dc:Event
P61160: http://www.rdaregistry.info/termList/statIdentification/1001
is part of: r166
narrower: cb18125790s
narrower: cb18074258j
narrower: https://data.bnf.fr/ark:/12148/cb12103487b
narrower: https://data.bnf.fr/ark:/12148/cb18126172f
narrower: cb12103461n
broader: cb11943455s
editorial note: Grand Larousse universel. - . - Encycl. universalis. - http://www.universalis.fr. - 2024-01-23
narrower: https://data.bnf.fr/ark:/12148/cb122149411
related: https://data.bnf.fr/ark:/12148/cb16263920d
alternative label: Sécession, Guerre de (États-Unis)
narrower: cb18125793t
narrower: https://data.bnf.fr/ark:/12148/cb181257887
related: cb11949920z
note: 12 avril 1861 : attaque de Fort Sumter (S.C.) par les Confédérés. 9 avril 1865 : reddition du général confédéré Robert E. Lee au général Ulysses S. Grant à Appomattox (Va.)
narrower: https://data.bnf.fr/ark:/12148/cb144350080
narrower: cb18126166h
narrower: cb12125281m
narrower: https://data.bnf.fr/ark:/12148/cb12067553b
related: https://data.bnf.fr/ark:/12148/cb11949915c
narrower: cb16708792j
narrower: cb18125792g
modified: 2024-01-23
scope note: Voir aussi la subdivision 1861-1865 (Guerre de Sécession) aux lieux américains (les vedettes construites sont entrées dans la liste d'autorité)
narrower: cb12204618g
alternative label: États-Unis (sud) -- 1861-1865 (Guerre de Sécession)
narrower: https://data.bnf.fr/ark:/12148/cb181257914
narrower: https://data.bnf.fr/ark:/12148/cb157659360
narrower: cb12437428x
is part of: r167
narrower: cb12039329s
created: 1985-07-07
narrower: cb11943452r
domaine litteral: Histoire du reste du monde
narrower: cb14534702s

dc:Event
date: https://data.bnf.fr/date/1861-1865/
date: 1861-1865

United States--History--Civil War, 1861-1865