Apprentissage automatique
broader: cb11932084t
note: Processus par lequel un algorithme évalue et améliore ses performances sans l'intervention d'un programmeur, en répétant son exécution sur des jeux de données jusqu'à obtenir, de manière régulière, des résultats pertinents.
related: cb18062242g
narrower: cb17706295v
broader: https://data.bnf.fr/ark:/12148/cb119395737
alternative label: Apprentissage artificiel
narrower: cb12564535j
type: Concept
narrower: cb16665972t
narrower: cb17127232k
alternative label: Apprentissage (intelligence artificielle)
P61160: http://www.rdaregistry.info/termList/statIdentification/1001
narrower: https://data.bnf.fr/ark:/12148/cb166607602
narrower: https://data.bnf.fr/ark:/12148/cb16627142b
modified: 2023-06-22
scope note: Sous cette vedette, on trouve les documents traitant de l'apprentissage par un système de raisonnement automatisé tout seul. Les documents sur la méthodologie de transfert des connaissances d'un expert humain vers le système se trouvent sous Acquisition des connaissances (systèmes experts)
FRBNF: 11987531
alternative label: Apprentissage statistique
broader: cb11977925t
related: https://data.bnf.fr/ark:/12148/cb18081563f
alternative label: Machine learning @en
related: cb12243073j
alternative label: Apprendimento automatico @it
is part of: r166
alternative label: Apprentissage machine
narrower: cb17142304t
domaine litteral: Savoir et érudition. Musées
narrower: https://data.bnf.fr/ark:/12148/cb18064460f
narrower: cb18135527p
domaine: https://data.bnf.fr/ark:/12148/cb11932109b
alternative label: Apprentissage-machine
narrower: https://data.bnf.fr/ark:/12148/cb171661008
broader: https://data.bnf.fr/ark:/12148/cb11977921f
related: cb18087533z
editorial note: Base terminologique de l'intelligence artificielle / Y. Kodratoff, M. Barès, 1991. - . - L'Apprentissage automatique : de la sélection de variables à l'apprentissage de structure d'un classifieur bayésien / H. Bouhamed, 2013 [thèse]. - . - Réseaux de neurones artificiels : une introduction à l'apprentissage automatique, 2006. - . -
created: 1985-10-11

Apprendimento automatico

Machine learning