Modes de vie
editorial note: Petit Robert 1, 2000. - . - Trésor de la langue française. - . -
alternative label: Manières de vivre
alternative label: Genre de vie
broader: https://data.bnf.fr/ark:/12148/cb119361486
modified: 2019-01-14
domaine litteral: Anthropologie. Ethnologie
alternative label: Façon de vivre
FRBNF: 11998921
narrower: https://data.bnf.fr/ark:/12148/cb17123721b
alternative label: Habitudes de vie
alternative label: Genres de vie
alternative label: Style de vie
type: Concept
scope note: Voir aussi aux différents modes de vie, par ex. : Communautés ; Vie de bohème ; Vie mondaine ; etc.
narrower: https://data.bnf.fr/ark:/12148/cb16522393d
domaine: https://data.bnf.fr/ark:/12148/cb119408497
scope note: Sous cette vedette, on trouve les documents théoriques sur les habitudes de vie particulières et sur la conduite qui en découle
alternative label: Vie quotidienne
P61160: http://www.rdaregistry.info/termList/statIdentification/1001
domaine litteral: Sciences sociales. Sociologie
alternative label: Mode d'existence
alternative label: Styles de vie
alternative label: Conditions d'existence
related: https://data.bnf.fr/ark:/12148/cb119486159
alternative label: Sociostyles
alternative label: Art de vivre
alternative label: Manière de vivre
is part of: r166
alternative label: Modes d'existence
alternative label: Mode de vie
related: cb17786271h
alternative label: Socio-styles
narrower: cb15586023g
alternative label: Façons de vivre
related: cb17025517v
alternative label: Conditions de vie
created: 1986-06-27
alternative label: Habitude de vie
broader: https://data.bnf.fr/ark:/12148/cb11932512b
related: cb11957836s

Lifestyles