Approvisionnement en eau
broader: https://data.bnf.fr/ark:/12148/cb119511085
narrower: https://data.bnf.fr/ark:/12148/cb11958735d
narrower: cb11983307g
narrower: https://data.bnf.fr/ark:/12148/cb11974277d
alternative label: Eau -- Captage
created: 1987-08-03
type: Concept
alternative label: Adduction d'eau
alternative label: Eau potable -- Approvisionnement
related match: Water-supply
narrower: https://data.bnf.fr/ark:/12148/cb119822801
alternative label: Alimentation en eau
broader: cb11967363h
alternative label: Eau -- Adduction
narrower: https://data.bnf.fr/ark:/12148/cb119795403
narrower: https://data.bnf.fr/ark:/12148/cb119384355
narrower: https://data.bnf.fr/ark:/12148/cb11979541f
narrower: cb12115867h
narrower: cb11949466w
scope note: S'emploie également en subdivision aux industries et sujets noms communs appropriés (types d'installations, d'usines, de procédés, etc.)
related: cb11977682t
narrower: cb11977855g
broader: cb12322531h
scope note: Sous cette vedette, on trouve les documents sur les estimations en ressources hydrauliques (tant de surface que souterraines) nécessaires à l'approvisionnement en eau pour les besoins domestiques, industriels ou agricoles, ainsi que sur l'installation et le fonctionnement des moyens utilisés pour cet approvisionnement
broader: cb11951150z
FRBNF: 12045696
narrower: https://data.bnf.fr/ark:/12148/cb119319126
narrower: cb12364639v
narrower: cb11939572w
related: https://data.bnf.fr/ark:/12148/cb119716602
narrower: https://data.bnf.fr/ark:/12148/cb123648591
related: cb16984356m
narrower: https://data.bnf.fr/ark:/12148/cb119833095
narrower: https://data.bnf.fr/ark:/12148/cb146337241
domaine: cb11933639w
P61160: http://www.rdaregistry.info/termList/statIdentification/1001
alternative label: Captage des eaux
related: https://data.bnf.fr/ark:/12148/cb11950155f
alternative label: Eau -- Approvisionnement
related: https://data.bnf.fr/ark:/12148/cb119771724
related: https://data.bnf.fr/ark:/12148/cb119798898
modified: 2018-12-07
narrower: https://data.bnf.fr/ark:/12148/cb119776835
is part of: r166
related: https://data.bnf.fr/ark:/12148/cb119759000