Lois
alternative label: Lois et règlements
broader: cb13318687s
P61160: http://www.rdaregistry.info/termList/statIdentification/1001
created: 1987-11-16
narrower: https://data.bnf.fr/ark:/12148/cb124478167
domaine: cb13318687s
alternative label: Statuts (lois)
broader: https://data.bnf.fr/ark:/12148/cb120673900
related: https://data.bnf.fr/ark:/12148/cb119829056
alternative label: Actes législatifs
FRBNF: 12048580
is part of: r166
alternative label: Loi
alternative label: Lois écrites
narrower: cb12316986n
narrower: cb16754976x
related: https://data.bnf.fr/ark:/12148/cb169025906
related: cb13319331k
related: cb17803606z
alternative label: Loi (droit)
type: Concept
scope note: Sous cette vedette, on trouve uniquement les documents sur la notion même de loi, et non les lois isolées ou les recueils de lois
narrower: cb14529675q
modified: 2023-06-07

Statutes