Quatuors à cordes
alternative label: Quatuors à cordes (violons (2), alto, violoncelle)
scope note: Voir aussi les vedettes du type Quatuors à cordes [distribution instrumentale], par ex. : Quatuors à cordes (violoncelles (4))
related: https://data.bnf.fr/ark:/12148/cb162565544
narrower: cb14629963q
scope note: Voir aussi les vedettes de musique comprenant une distribution de quatre instruments à archet, par ex. : Suites (violons (3), violoncelle), ainsi que les vedettes de musique comprenant l'expression "ensemble à cordes", par ex. : Clarinette et ensemble à cordes
narrower: cb16969865r
narrower: cb14627087r
alternative label: Quatuors d'archets
is part of: r166
modified: 2023-06-07
in scheme: rameau
type: Concept
editorial note: Grand Larousse universel (art. : Quatuor) : quatuor d'archets. - . - Dict. de la musique / M. Vignal, 2005. - . -
scope note: Sous cette vedette, on trouve les compositions (qui n'ont pas de forme ou de genre particulier) pour deux violons, alto et violoncelle, ainsi que les compositions pour différentes combinaisons de quatre instruments à archet. Les documents sur le quatuor à cordes en tant que formation musicale se trouvent sous Ensembles de musique de chambre
related match: String quartets
alternative label: Musique pour quatuor à cordes
alternative label: Quatuors pour instruments à cordes
is part of: Genre
narrower: cb16962942p
broader: https://data.bnf.fr/ark:/12148/cb120497727
narrower: https://data.bnf.fr/ark:/12148/cb170837264
alternative label: Quatuors pour cordes
narrower: cb17081832v
narrower: https://data.bnf.fr/ark:/12148/cb167339679
narrower: cb14624841x
narrower: https://data.bnf.fr/ark:/12148/cb162059946
narrower: https://data.bnf.fr/ark:/12148/cb170824200
P61160: http://www.rdaregistry.info/termList/statIdentification/1001
narrower: https://data.bnf.fr/ark:/12148/cb12351172c
alternative label: Quatuor à cordes, Musique de
narrower: cb15014847w
domaine: https://data.bnf.fr/ark:/12148/cb133183660
narrower: cb16968541p
created: 1987-11-16
FRBNF: 12049903
narrower: cb16968519h
scope note: Les compositions pour quatuors à cordes pincées se trouvent sous Quatuors à cordes pincées

RAMEAU (Répertoire d'autorité-matière encyclopédique et alphabétique unifié)
type: ConceptScheme

Genre
type: ConceptGroup
member: Quatuors à cordes
type: Collection