Amis et relations
alternative label: Copains
is part of: r166
related match: Friends and associates
related: cb12073022x
broader: https://data.bnf.fr/ark:/12148/cb120760052
P61160: http://www.rdaregistry.info/termList/statIdentification/1001
alternative label: Camarades
alternative label: Amis
domaine litteral: Sciences sociales. Sociologie
FRBNF: 12065684
alternative label: Connaissances (personnes)
alternative label: Relations (personnes)
related: https://data.bnf.fr/ark:/12148/cb119373318
type: Concept
scope note: S'emploie uniquement en subdivision aux personnes
modified: 2018-12-07
alternative label: Collègues
created: 1988-02-05