Réchauffement de la Terre
related: cb17017311h
scope note: Voir aussi la subdivision Effets du réchauffement de la Terre aux êtres vivants, matériaux, parties du corps, produits chimiques et sujets noms communs appropriés
is part of: r166
alternative label: Réchauffement climatique
related: cb11941537n
related: https://data.bnf.fr/ark:/12148/cb131775399
related: https://data.bnf.fr/ark:/12148/cb119830305
domaine: cb11936451x
related: https://data.bnf.fr/ark:/12148/cb178815959
modified: 2023-06-07
broader: https://data.bnf.fr/ark:/12148/cb137436318
related: https://data.bnf.fr/ark:/12148/cb166421896
alternative label: Climat -- Réchauffement
P61160: http://www.rdaregistry.info/termList/statIdentification/1001
FRBNF: 12156561
created: 1990-08-01
type: Concept
related match: Global warming
alternative label: Terre -- Réchauffement