Hautbois et piano, Musique de
narrower: cb14621990p
narrower: cb14628726q
narrower: cb14620624t
FRBNF: 12288625
P61160: http://www.rdaregistry.info/termList/statIdentification/1001
type: Concept
narrower: https://data.bnf.fr/ark:/12148/cb146294322
narrower: https://data.bnf.fr/ark:/12148/cb170987078
related match: Oboe and piano music
scope note: Sous cette vedette, on trouve les compositions (qui n'ont pas de forme ou de genre particulier) pour hautbois et piano, et les recueils de compositions de formes et de genres différents pour hautbois et piano
narrower: https://data.bnf.fr/ark:/12148/cb150151027
created: 1993-01-19
in scheme: rameau
narrower: https://data.bnf.fr/ark:/12148/cb166885229
narrower: https://data.bnf.fr/ark:/12148/cb123316323
alternative label: Piano et hautbois, Musique de
narrower: https://data.bnf.fr/ark:/12148/cb16500906d
narrower: cb14621530q
narrower: cb17021895h
narrower: cb16971152r
narrower: cb12345673v
is part of: Genre
modified: 2023-06-08
narrower: cb16254058n
is part of: r166
narrower: cb17922581s
narrower: cb18066233g
narrower: cb16254145k
domaine: https://data.bnf.fr/ark:/12148/cb133183660

Genre
type: Collection
member: Hautbois et piano, Musique de
type: ConceptGroup

RAMEAU (Répertoire d'autorité-matière encyclopédique et alphabétique unifié)
type: ConceptScheme